Reaction Details
TargetBeta-carbonic anhydrase 1
LigandBDBM50339590
Substrate/Competitorn/a
Meas. Tech.ChEMBL_736723 (CHEMBL1695104)
Ki 840±n/a nM
Citation Davis, RAHofmann, AOsman, AHall, RAMühlschlegel, FAVullo, DInnocenti, ASupuran, CTPoulsen, SA Natural product-based phenols as novel probes for mycobacterial and fungal carbonic anhydrases. J Med Chem54:1682-92 (2011) 
 
Beta-carbonic anhydrase 1
Name:Beta-carbonic anhydrase 1
Type:Enzyme
Mol. Mass.:18186.06
Organism:Mycobacterium tuberculosis
Description:The recombinant GST-mtCA1 construct was cloned, expressed, and further purified from E. coli. The purified protein was used in inhibition assays.
Residue:163
BDBM50339590
NameBDBM50339590
Synonyms:(-)-xylariamide A CHEMBL463133
TypeSmall organic molecule
Emp. Form.C14H14ClNO6
Mol. Mass.327.717
SMILESCOC(=O)\C=C\C(=O)N[C@H](Cc1ccc(O)c(Cl)c1)C(O)=O