Reaction Details
TargetBeta-carbonic anhydrase 1
LigandBDBM50339593
Substrate/Competitorn/a
Meas. Tech.ChEMBL_736723 (CHEMBL1695104)
Ki 910±n/a nM
Citation Davis, RAHofmann, AOsman, AHall, RAMühlschlegel, FAVullo, DInnocenti, ASupuran, CTPoulsen, SA Natural product-based phenols as novel probes for mycobacterial and fungal carbonic anhydrases. J Med Chem54:1682-92 (2011) 
 
Beta-carbonic anhydrase 1
Name:Beta-carbonic anhydrase 1
Type:Enzyme
Mol. Mass.:18186.06
Organism:Mycobacterium tuberculosis
Description:The recombinant GST-mtCA1 construct was cloned, expressed, and further purified from E. coli. The purified protein was used in inhibition assays.
Residue:163
BDBM50339593
NameBDBM50339593
Synonyms:2-amino-4-(3,4-dihydroxybenzylidene)-1H-imidazol-5(4H)-one polyandrocarpamine B
TypeSmall organic molecule
Emp. Form.C10H9N3O3
Mol. Mass.219.1968
SMILESNC1=NC(=Cc2ccc(O)c(O)c2)C(=O)N1