Reaction Details
TargetBeta-carbonic anhydrase 1
LigandBDBM50339597
Substrate/Competitorn/a
Meas. Tech.ChEMBL_736723 (CHEMBL1695104)
Ki 12200±n/a nM
Citation Davis, RAHofmann, AOsman, AHall, RAMühlschlegel, FAVullo, DInnocenti, ASupuran, CTPoulsen, SA Natural product-based phenols as novel probes for mycobacterial and fungal carbonic anhydrases. J Med Chem54:1682-92 (2011) 
 
Beta-carbonic anhydrase 1
Name:Beta-carbonic anhydrase 1
Type:Enzyme
Mol. Mass.:18186.06
Organism:Mycobacterium tuberculosis
Description:The recombinant GST-mtCA1 construct was cloned, expressed, and further purified from E. coli. The purified protein was used in inhibition assays.
Residue:163
BDBM50339597
NameBDBM50339597
Synonyms:CHEMBL589354 | N-benzyl-2-(3-chloro-4-hydroxyphenyl)acetamide
TypeSmall organic molecule
Emp. Form.C15H14ClNO2
Mol. Mass.275.73
SMILESOc1ccc(CC(=O)NCc2ccccc2)cc1Cl