Reaction Details
TargetCarbonic anhydrase
LigandBDBM50216277
Substrate/Competitorn/a
Meas. Tech.ChEMBL_736724 (CHEMBL1695105)
Ki 730±n/a nM
Citation Davis, RAHofmann, AOsman, AHall, RAMühlschlegel, FAVullo, DInnocenti, ASupuran, CTPoulsen, SA Natural product-based phenols as novel probes for mycobacterial and fungal carbonic anhydrases. J Med Chem54:1682-92 (2011) 
 
Carbonic anhydrase
Name:Carbonic anhydrase
Type:Enzyme
Mol. Mass.:31587.59
Organism:Candida albicans (Yeast)
Description:n/a
Residue:281
BDBM50216277
NameBDBM50216277
Synonyms:4,4'-((1R,2R,3S,4S)-3,4-dimethylcyclobutane-1,2-diyl)bis(2-methoxyphenol) CHEMBL228274 | endiandrin A
TypeSmall organic molecule
Emp. Form.C20H24O4
Mol. Mass.328.4022
SMILESCOc1cc(ccc1O)[C@@H]1[C@@H](C)[C@H](C)[C@H]1c1ccc(O)c(OC)c1