Reaction Details
TargetRAF proto-oncogene serine/threonine-protein kinase
LigandBDBM50339619
Substrate/Competitorn/a
Meas. Tech.ChEMBL_734963 (CHEMBL1693570)
IC50 70±n/a nM
Citation Gould, AEAdams, RAdhikari, SAertgeerts, KAfroze, RBlackburn, CCalderwood, EFChau, RChouitar, JDuffey, MOEngland, DBFarrer, CForsyth, NGarcia, KGaulin, JGreenspan, PDGuo, RHarrison, SJHuang, SCIartchouk, NJanowick, DKim, MSKulkarni, BLangston, SPLiu, JXMa, LTMenon, SMizutani, HPaske, ERenou, CCRezaei, MRowland, RSSintchak, MDSmith, MDStroud, SGTregay, MTian, YVeiby, OPVos, TJVyskocil, SWilliams, JXu, TYang, JJYano, JZeng, HZhang, DMZhang, QGalvin, KM Design and optimization of potent and orally bioavailable tetrahydronaphthalene Raf inhibitors. J Med Chem54:1836-46 (2011) 
 
RAF proto-oncogene serine/threonine-protein kinase
Name:RAF proto-oncogene serine/threonine-protein kinase
Type:Serine/threonine-protein kinase
Mol. Mass.:73082.52
Organism:Homo sapiens (Human)
Description:P04049
Residue:648
BDBM50339619
NameBDBM50339619
Synonyms:CHEMBL1688874 | N-[(2R)-7-({2-[(cyclopropylcarbonyl)amino]pyridin-4-yl}oxy)-1,2,3,4-tetrahydronaphthalen-2-yl]-3-[(dimethylamino)methyl]-5-(trifluoromethyl)benzamide
TypeSmall organic molecule
Emp. Form.C30H31F3N4O3
Mol. Mass.552.5873
SMILESCN(C)Cc1cc(cc(c1)C(F)(F)F)C(=O)N[C@@H]1CCc2ccc(Oc3ccnc(NC(=O)C4CC4)c3)cc2C1