Reaction Details
TargetRAF proto-oncogene serine/threonine-protein kinase
LigandBDBM50339623
Substrate/Competitorn/a
Meas. Tech.ChEMBL_734962 (CHEMBL1693569)
IC50 9±n/a nM
Citation Gould, AEAdams, RAdhikari, SAertgeerts, KAfroze, RBlackburn, CCalderwood, EFChau, RChouitar, JDuffey, MOEngland, DBFarrer, CForsyth, NGarcia, KGaulin, JGreenspan, PDGuo, RHarrison, SJHuang, SCIartchouk, NJanowick, DKim, MSKulkarni, BLangston, SPLiu, JXMa, LTMenon, SMizutani, HPaske, ERenou, CCRezaei, MRowland, RSSintchak, MDSmith, MDStroud, SGTregay, MTian, YVeiby, OPVos, TJVyskocil, SWilliams, JXu, TYang, JJYano, JZeng, HZhang, DMZhang, QGalvin, KM Design and optimization of potent and orally bioavailable tetrahydronaphthalene Raf inhibitors. J Med Chem54:1836-46 (2011) 
 
RAF proto-oncogene serine/threonine-protein kinase
Name:RAF proto-oncogene serine/threonine-protein kinase
Type:Serine/threonine-protein kinase
Mol. Mass.:73082.52
Organism:Homo sapiens (Human)
Description:P04049
Residue:648
BDBM50339623
NameBDBM50339623
Synonyms:4-[3-(3-{[4-Chloro-3-(trifluoromethyl)phenyl]amino}-3-oxopropyl)phenoxy]-N-methylpyridine-2-carboxamide | CHEMBL1688863
TypeSmall organic molecule
Emp. Form.C23H19ClF3N3O3
Mol. Mass.477.863
SMILESCNC(=O)c1cc(Oc2cccc(CCC(=O)Nc3ccc(Cl)c(c3)C(F)(F)F)c2)ccn1