Reaction Details
TargetRAF proto-oncogene serine/threonine-protein kinase
LigandBDBM50339613
Substrate/Competitorn/a
Meas. Tech.ChEMBL_734962 (CHEMBL1693569)
IC50 4.5±n/a nM
Citation Gould, AEAdams, RAdhikari, SAertgeerts, KAfroze, RBlackburn, CCalderwood, EFChau, RChouitar, JDuffey, MOEngland, DBFarrer, CForsyth, NGarcia, KGaulin, JGreenspan, PDGuo, RHarrison, SJHuang, SCIartchouk, NJanowick, DKim, MSKulkarni, BLangston, SPLiu, JXMa, LTMenon, SMizutani, HPaske, ERenou, CCRezaei, MRowland, RSSintchak, MDSmith, MDStroud, SGTregay, MTian, YVeiby, OPVos, TJVyskocil, SWilliams, JXu, TYang, JJYano, JZeng, HZhang, DMZhang, QGalvin, KM Design and optimization of potent and orally bioavailable tetrahydronaphthalene Raf inhibitors. J Med Chem54:1836-46 (2011) 
 
RAF proto-oncogene serine/threonine-protein kinase
Name:RAF proto-oncogene serine/threonine-protein kinase
Type:Serine/threonine-protein kinase
Mol. Mass.:73082.52
Organism:Homo sapiens (Human)
Description:P04049
Residue:648
BDBM50339613
NameBDBM50339613
Synonyms:(2S)-N-[3-(aminomethyl)-5-(trifluoromethyl)phenyl]-7-({2-[(cyclopropylcarbonyl)amino]pyridin-4-yl}oxy)-1,2,3,4-tetrahydronaphthalene-2-carboxamide | CHEMBL1688869
TypeSmall organic molecule
Emp. Form.C28H27F3N4O3
Mol. Mass.524.5342
SMILESNCc1cc(NC(=O)[C@H]2CCc3ccc(Oc4ccnc(NC(=O)C5CC5)c4)cc3C2)cc(c1)C(F)(F)F