Reaction Details
TargetC-C chemokine receptor type 5
LigandBDBM50339636
Substrate/Competitorn/a
Meas. Tech.ChEMBL_735055 (CHEMBL1693896)
IC50>10000±n/a nM
Citation Laborde, EMacsata, RWMeng, FPeterson, BTRobinson, LSchow, SRSimon, RJXu, HBaba, KInagaki, HIshiwata, YJomori, TMatsumoto, YMiyachi, ANakamura, TOkamoto, MHandel, TMBernard, CC Discovery, optimization, and pharmacological characterization of novel heteroaroylphenylureas antagonists of C-C chemokine ligand 2 function. J Med Chem54:1667-81 (2011) 
 
C-C chemokine receptor type 5
Name:C-C chemokine receptor type 5
Type:Enzyme
Mol. Mass.:40540.21
Organism:Homo sapiens (Human)
Description:P51681
Residue:352
BDBM50339636
NameBDBM50339636
Synonyms:1-(6-((2-(Dimethylamino)ethyl)(methyl)amino)-1,3-dimethyl-1H-pyrazolo[3,4-b]pyridine-5-carbonyl)-3-(3-isopropoxyphenyl)urea Hydrochloride | CHEMBL1688889
TypeSmall organic molecule
Emp. Form.C24H33N7O3
Mol. Mass.467.5639
SMILESCC(C)Oc1cccc(NC(=O)NC(=O)c2cc3c(C)nn(C)c3nc2N(C)CCN(C)C)c1