Reaction Details
TargetC-C chemokine receptor type 2
LigandBDBM50339638
Substrate/Competitorn/a
Meas. Tech.ChEMBL_735000 (CHEMBL1693607)
IC50>10000±n/a nM
Citation Laborde, EMacsata, RWMeng, FPeterson, BTRobinson, LSchow, SRSimon, RJXu, HBaba, KInagaki, HIshiwata, YJomori, TMatsumoto, YMiyachi, ANakamura, TOkamoto, MHandel, TMBernard, CC Discovery, optimization, and pharmacological characterization of novel heteroaroylphenylureas antagonists of C-C chemokine ligand 2 function. J Med Chem54:1667-81 (2011) 
 
C-C chemokine receptor type 2
Name:C-C chemokine receptor type 2
Type:Enzyme
Mol. Mass.:41932.32
Organism:Homo sapiens (Human)
Description:P41597
Residue:374
BDBM50339638
NameBDBM50339638
Synonyms:5-(Benzo[d][1,3]dioxol-5-yl)-N-(3,4-dichlorophenyl)-1,2,4-oxadiazol-3-amine | CHEMBL1688886
TypeSmall organic molecule
Emp. Form.C15H9Cl2N3O3
Mol. Mass.350.156
SMILESClc1ccc(Nc2noc(n2)-c2ccc3OCOc3c2)cc1Cl