Reaction Details
TargetKinesin-like protein KIF11
LigandBDBM23780
Substrate/Competitorn/a
Meas. Tech.ChEMBL_735125 (CHEMBL1694081)
IC50 16.3±n/a nM
Citation Kaan, HYWeiss, JMenger, DUlaganathan, VTkocz, KLaggner, CPopowycz, FJoseph, BKozielski, F Structure-activity relationship and multidrug resistance study of new S-trityl-L-cysteine derivatives as inhibitors of Eg5. J Med Chem54:1576-86 (2011) 
 
Kinesin-like protein KIF11
Name:Kinesin-like protein KIF11
Type:PROTEIN
Mol. Mass.:119138.97
Organism:Homo sapiens (Human)
Description:ChEMBL_1457426
Residue:1056
BDBM23780
NameBDBM23780
Synonyms:(2R)-2-amino-3-[(naphthalen-2-yldiphenylmethyl)sulfanyl]propanoic acid | S-Trityl-L-Cysteine (STLC) Analogue, 9
TypeSmall organic molecule
Emp. Form.C26H23NO2S
Mol. Mass.413.531
SMILESN[C@@H](CSC(c1ccccc1)(c1ccccc1)c1ccc2ccccc2c1)C(O)=O