Reaction Details
TargetKinesin-like protein KIF11
LigandBDBM23802
Substrate/Competitorn/a
Meas. Tech.ChEMBL_735125 (CHEMBL1694081)
IC50 395.61±n/a nM
Citation Kaan, HYWeiss, JMenger, DUlaganathan, VTkocz, KLaggner, CPopowycz, FJoseph, BKozielski, F Structure-activity relationship and multidrug resistance study of new S-trityl-L-cysteine derivatives as inhibitors of Eg5. J Med Chem54:1576-86 (2011) 
 
Kinesin-like protein KIF11
Name:Kinesin-like protein KIF11
Type:PROTEIN
Mol. Mass.:119138.97
Organism:Homo sapiens (Human)
Description:ChEMBL_1457426
Residue:1056
BDBM23802
NameBDBM23802
Synonyms:2-[(triphenylmethyl)sulfanyl]ethan-1-amine | Triphenylmethyl-containing compound, 31
TypeSmall organic molecule
Emp. Form.C21H21NS
Mol. Mass.319.463
SMILESNCCSC(c1ccccc1)(c1ccccc1)c1ccccc1