Reaction Details
TargetKinesin-like protein KIF11
LigandBDBM23822
Substrate/Competitorn/a
Meas. Tech.ChEMBL_735125 (CHEMBL1694081)
IC50 61.7±n/a nM
Citation Kaan, HYWeiss, JMenger, DUlaganathan, VTkocz, KLaggner, CPopowycz, FJoseph, BKozielski, F Structure-activity relationship and multidrug resistance study of new S-trityl-L-cysteine derivatives as inhibitors of Eg5. J Med Chem54:1576-86 (2011) 
 
Kinesin-like protein KIF11
Name:Kinesin-like protein KIF11
Type:PROTEIN
Mol. Mass.:119138.97
Organism:Homo sapiens (Human)
Description:ChEMBL_1457426
Residue:1056
BDBM23822
NameBDBM23822
Synonyms:(2R)-2-amino-3-{[(4-methylphenyl)diphenylmethyl]sulfanyl}propanoic acid | S-Trityl-L-Cysteine (STLC) Analogue, 51
TypeSmall organic molecule
Emp. Form.C23H23NO2S
Mol. Mass.377.499
SMILESCc1ccc(cc1)C(SC[C@H](N)C(O)=O)(c1ccccc1)c1ccccc1