Reaction Details
TargetCoagulation factor X
LigandBDBM50339712
Substrate/Competitorn/a
Meas. Tech.ChEMBL_735257 (CHEMBL1694519)
Ki 1±n/a nM
Citation Watson, NSAdams, CBelton, DBrown, DBurns-Kurtis, CLChaudry, LChan, CConvery, MADavies, DEExall, AMHarling, JDIrvine, SIrving, WRKleanthous, SMcLay, IMPateman, AJPatikis, ANRoethke, TJSenger, SStelman, GJToomey, JRWest, RIWhittaker, CZhou, PYoung, RJ The discovery of potent and long-acting oral factor Xa inhibitors with tetrahydroisoquinoline and benzazepine P4 motifs. Bioorg Med Chem Lett21:1588-92 (2011) 
 
Coagulation factor X
Name:Coagulation factor X
Type:Enzyme
Mol. Mass.:54726.60
Organism:Homo sapiens (Human)
Description:n/a
Residue:488
BDBM50339712
NameBDBM50339712
Synonyms:(S,E)-2-(5-chlorothiophen-2-yl)-N-(2-oxo-1-(2,3,4,5-tetrahydro-1H-benzo[c]azepin-7-yl)pyrrolidin-3-yl)ethenesulfonamide | CHEMBL1689026
TypeSmall organic molecule
Emp. Form.C20H22ClN3O3S2
Mol. Mass.451.99
SMILESClc1ccc(\C=C\S(=O)(=O)N[C@H]2CCN(C2=O)c2ccc3CNCCCc3c2)s1