Reaction Details
TargetProstaglandin D2 receptor 2
LigandBDBM50339759
Substrate/Competitorn/a
Meas. Tech.ChEMBL_735525 (CHEMBL1693030)
IC50 6.8±n/a nM
Citation Luker, TBonnert, RPaine, SWSchmidt, JSargent, CCook, ARCook, AGardiner, PHill, SWeyman-Jones, CPatel, AThom, SThorne, P Zwitterionic CRTh2 antagonists. J Med Chem54:1779-88 (2011) 
 
Prostaglandin D2 receptor 2
Name:Prostaglandin D2 receptor 2
Type:Enzyme
Mol. Mass.:43295.45
Organism:Homo sapiens (Human)
Description:Q9Y5Y4
Residue:395
BDBM50339759
NameBDBM50339759
Synonyms:(S)-2-(4-chloro-2-((4-(2-(3-chlorophenyl)acetyl)-3-methylpiperazin-1-yl)methyl)phenoxy)acetic acid | CHEMBL1689130
TypeSmall organic molecule
Emp. Form.C22H24Cl2N2O4
Mol. Mass.451.343
SMILESC[C@H]1CN(Cc2cc(Cl)ccc2OCC(O)=O)CCN1C(=O)Cc1cccc(Cl)c1