Reaction Details
TargetProstaglandin D2 receptor 2
LigandBDBM50339753
Substrate/Competitorn/a
Meas. Tech.ChEMBL_735525 (CHEMBL1693030)
IC50 1.3±n/a nM
Citation Luker, TBonnert, RPaine, SWSchmidt, JSargent, CCook, ARCook, AGardiner, PHill, SWeyman-Jones, CPatel, AThom, SThorne, P Zwitterionic CRTh2 antagonists. J Med Chem54:1779-88 (2011) 
 
Prostaglandin D2 receptor 2
Name:Prostaglandin D2 receptor 2
Type:Enzyme
Mol. Mass.:43295.45
Organism:Homo sapiens (Human)
Description:Q9Y5Y4
Residue:395
BDBM50339753
NameBDBM50339753
Synonyms:(S)-2-(4-chloro-2-(((S)-4-(2-(4-chlorophenyl)acetyl)-3-methylpiperazin-1-yl)methyl)phenoxy)propanoic acid | CHEMBL1689133
TypeSmall organic molecule
Emp. Form.C23H26Cl2N2O4
Mol. Mass.465.37
SMILESC[C@H](Oc1ccc(Cl)cc1CN1CCN([C@@H](C)C1)C(=O)Cc1ccc(Cl)cc1)C(O)=O