Reaction Details
TargetProstaglandin D2 receptor 2
LigandBDBM50339752
Substrate/Competitorn/a
Meas. Tech.ChEMBL_735525 (CHEMBL1693030)
IC50 1.3±n/a nM
Citation Luker, TBonnert, RPaine, SWSchmidt, JSargent, CCook, ARCook, AGardiner, PHill, SWeyman-Jones, CPatel, AThom, SThorne, P Zwitterionic CRTh2 antagonists. J Med Chem54:1779-88 (2011) 
 
Prostaglandin D2 receptor 2
Name:Prostaglandin D2 receptor 2
Type:Enzyme
Mol. Mass.:43295.45
Organism:Homo sapiens (Human)
Description:Q9Y5Y4
Residue:395
BDBM50339752
NameBDBM50339752
Synonyms:(S)-2-(4-chloro-2-((4-(phenylsulfonyl)-3-propylpiperazin-1-yl)methyl)phenoxy)acetic acid | CHEMBL1689124
TypeSmall organic molecule
Emp. Form.C22H27ClN2O5S
Mol. Mass.466.978
SMILESCCC[C@H]1CN(Cc2cc(Cl)ccc2OCC(O)=O)CCN1S(=O)(=O)c1ccccc1