Reaction Details
TargetProstaglandin D2 receptor 2
LigandBDBM50339749
Substrate/Competitorn/a
Meas. Tech.ChEMBL_735525 (CHEMBL1693030)
IC50 0.60±n/a nM
Citation Luker, TBonnert, RPaine, SWSchmidt, JSargent, CCook, ARCook, AGardiner, PHill, SWeyman-Jones, CPatel, AThom, SThorne, P Zwitterionic CRTh2 antagonists. J Med Chem54:1779-88 (2011) 
 
Prostaglandin D2 receptor 2
Name:Prostaglandin D2 receptor 2
Type:Enzyme
Mol. Mass.:43295.45
Organism:Homo sapiens (Human)
Description:Q9Y5Y4
Residue:395
BDBM50339749
NameBDBM50339749
Synonyms:(S)-2-(2-((4-(benzylsulfonyl)-3-methylpiperazin-1-yl)methyl)-4-chlorophenyl)acetic acid | CHEMBL1689137
TypeSmall organic molecule
Emp. Form.C21H25ClN2O4S
Mol. Mass.436.952
SMILESC[C@H]1CN(Cc2cc(Cl)ccc2CC(O)=O)CCN1S(=O)(=O)Cc1ccccc1