Reaction Details
TargetCarbonic anhydrase 12
LigandBDBM50334361
Substrate/Competitorn/a
Meas. Tech.ChEMBL_735542 (CHEMBL1693047)
Ki 4.2±n/a nM
Citation Pacchiano, FCarta, FMcDonald, PCLou, YVullo, DScozzafava, ADedhar, SSupuran, CT Ureido-substituted benzenesulfonamides potently inhibit carbonic anhydrase IX and show antimetastatic activity in a model of breast cancer metastasis. J Med Chem54:1896-902 (2011) 
 
Carbonic anhydrase 12
Name:Carbonic anhydrase 12
Type:Enzyme
Mol. Mass.:39456.00
Organism:Homo sapiens (Human)
Description:Catalytic domain of human cloned isozyme was used in the assay
Residue:354
BDBM50334361
NameBDBM50334361
Synonyms:4-(3-(2-isopropylphenyl)ureido)benzenesulfonamide 4-{([(2'-Isopropylphenyl)amino]carbonyl)amino}benzenesulfonamide | CHEMBL1615280
TypeSmall organic molecule
Emp. Form.C16H19N3O3S
Mol. Mass.333.405
SMILESCC(C)c1ccccc1NC(=O)Nc1ccc(cc1)S(N)(=O)=O