Reaction Details
TargetCarbonic anhydrase 12
LigandBDBM54376
Substrate/Competitorn/a
Meas. Tech.ChEMBL_735542 (CHEMBL1693047)
Ki 5.3±n/a nM
Citation Pacchiano, FCarta, FMcDonald, PCLou, YVullo, DScozzafava, ADedhar, SSupuran, CT Ureido-substituted benzenesulfonamides potently inhibit carbonic anhydrase IX and show antimetastatic activity in a model of breast cancer metastasis. J Med Chem54:1896-902 (2011) 
 
Carbonic anhydrase 12
Name:Carbonic anhydrase 12
Type:Enzyme
Mol. Mass.:39456.00
Organism:Homo sapiens (Human)
Description:Catalytic domain of human cloned isozyme was used in the assay
Residue:354
BDBM54376
NameBDBM54376
Synonyms:6-Hexyl-7-hydroxy-2-oxo-2H-chromene-3-carboxylic acid ethyl ester 6-hexyl-7-hydroxy-2-oxo-1-benzopyran-3-carboxylic acid ethyl ester SMR000413981 ethyl 6-hexyl-7-hydroxy-2-oxochromene-3-carboxylate | ethyl 6-hexyl-7-oxidanyl-2-oxidanylidene-chromene-3-carboxylate
TypeSmall organic molecule
Emp. Form.C18H22O5
Mol. Mass.318.3643
SMILESCCCCCCc1cc2cc(C(=O)OCC)c(=O)oc2cc1O