Reaction Details
TargetCarbonic anhydrase 1
LigandBDBM50334347
Substrate/Competitorn/a
Meas. Tech.ChEMBL_735539 (CHEMBL1693044)
Ki 604±n/a nM
Citation Pacchiano, FCarta, FMcDonald, PCLou, YVullo, DScozzafava, ADedhar, SSupuran, CT Ureido-substituted benzenesulfonamides potently inhibit carbonic anhydrase IX and show antimetastatic activity in a model of breast cancer metastasis. J Med Chem54:1896-902 (2011) 
 
Carbonic anhydrase 1
Name:Carbonic anhydrase 1
Type:Enzyme
Mol. Mass.:28873.37
Organism:Homo sapiens (Human)
Description:P00915
Residue:261
BDBM50334347
NameBDBM50334347
Synonyms:4-(3-(4-phenoxyphenyl)ureido)benzenesulfonamide CHEMBL1643302
TypeSmall organic molecule
Emp. Form.C19H17N3O4S
Mol. Mass.383.421
SMILESNS(=O)(=O)c1ccc(NC(=O)Nc2ccc(Oc3ccccc3)cc2)cc1