Reaction Details
TargetCarbonic anhydrase 9
LigandBDBM50334348
Substrate/Competitorn/a
Meas. Tech.ChEMBL_735541 (CHEMBL1693046)
Ki 66±n/a nM
Citation Pacchiano, FCarta, FMcDonald, PCLou, YVullo, DScozzafava, ADedhar, SSupuran, CT Ureido-substituted benzenesulfonamides potently inhibit carbonic anhydrase IX and show antimetastatic activity in a model of breast cancer metastasis. J Med Chem54:1896-902 (2011) 
 
Carbonic anhydrase 9
Name:Carbonic anhydrase 9
Type:Enzyme
Mol. Mass.:49669.03
Organism:Homo sapiens (Human)
Description:Catalytic domain of human cloned isozyme was used in the assay
Residue:459
BDBM50334348
NameBDBM50334348
Synonyms:4-(3-biphenyl-2-ylureido)benzenesulfonamide CHEMBL1643303
TypeSmall organic molecule
Emp. Form.C19H17N3O3S
Mol. Mass.367.422
SMILESNS(=O)(=O)c1ccc(NC(=O)Nc2ccccc2-c2ccccc2)cc1