Reaction Details
TargetCarbonic anhydrase 2
LigandBDBM50334352
Substrate/Competitorn/a
Meas. Tech.ChEMBL_735540 (CHEMBL1693045)
Ki 226±n/a nM
Citation Pacchiano, FCarta, FMcDonald, PCLou, YVullo, DScozzafava, ADedhar, SSupuran, CT Ureido-substituted benzenesulfonamides potently inhibit carbonic anhydrase IX and show antimetastatic activity in a model of breast cancer metastasis. J Med Chem54:1896-902 (2011) 
 
Carbonic anhydrase 2
Name:Carbonic anhydrase 2
Type:Enzyme
Mol. Mass.:29250.71
Organism:Homo sapiens (Human)
Description:P00918
Residue:260
BDBM50334352
NameBDBM50334352
Synonyms:4-(3-cyclopentylureido)benzenesulfonamide CHEMBL1615215
TypeSmall organic molecule
Emp. Form.C12H17N3O3S
Mol. Mass.283.347
SMILESNS(=O)(=O)c1ccc(NC(=O)NC2CCCC2)cc1