Reaction Details
TargetCarbonic anhydrase 9
LigandBDBM50334342
Substrate/Competitorn/a
Meas. Tech.ChEMBL_735541 (CHEMBL1693046)
Ki 7±n/a nM
Citation Pacchiano, FCarta, FMcDonald, PCLou, YVullo, DScozzafava, ADedhar, SSupuran, CT Ureido-substituted benzenesulfonamides potently inhibit carbonic anhydrase IX and show antimetastatic activity in a model of breast cancer metastasis. J Med Chem54:1896-902 (2011) 
 
Carbonic anhydrase 9
Name:Carbonic anhydrase 9
Type:Enzyme
Mol. Mass.:49669.03
Organism:Homo sapiens (Human)
Description:Catalytic domain of human cloned isozyme was used in the assay
Residue:459
BDBM50334342
NameBDBM50334342
Synonyms:4-(3-(2,3-dihydro-1H-inden-5-yl)ureido)benzenesulfonamide CHEMBL1643307
TypeSmall organic molecule
Emp. Form.C16H17N3O3S
Mol. Mass.331.389
SMILESNS(=O)(=O)c1ccc(NC(=O)Nc2ccc3CCCc3c2)cc1