Reaction Details
TargetCarbonic anhydrase 12
LigandBDBM50334365
Substrate/Competitorn/a
Meas. Tech.ChEMBL_735542 (CHEMBL1693047)
Ki 53±n/a nM
Citation Pacchiano, FCarta, FMcDonald, PCLou, YVullo, DScozzafava, ADedhar, SSupuran, CT Ureido-substituted benzenesulfonamides potently inhibit carbonic anhydrase IX and show antimetastatic activity in a model of breast cancer metastasis. J Med Chem54:1896-902 (2011) 
 
Carbonic anhydrase 12
Name:Carbonic anhydrase 12
Type:Enzyme
Mol. Mass.:39456.00
Organism:Homo sapiens (Human)
Description:Catalytic domain of human cloned isozyme was used in the assay
Residue:354
BDBM50334365
NameBDBM50334365
Synonyms:4-(3-(4-octylphenyl)ureido)benzenesulfonamide CHEMBL1643299
TypeSmall organic molecule
Emp. Form.C21H29N3O3S
Mol. Mass.403.538
SMILESCCCCCCCCc1ccc(NC(=O)Nc2ccc(cc2)S(N)(=O)=O)cc1