Reaction Details
TargetApoptosis regulator Bcl-2
LigandBDBM50339783
Substrate/Competitorn/a
Meas. Tech.ChEMBL_735550 (CHEMBL1693055)
IC50 5±n/a nM
Citation Sleebs, BECzabotar, PEFairbrother, WJFairlie, WDFlygare, JAHuang, DCKersten, WJKoehler, MFLessene, GLowes, KParisot, JPSmith, BJSmith, MLSouers, AJStreet, IPYang, HBaell, JB Quinazoline sulfonamides as dual binders of the proteins B-cell lymphoma 2 and B-cell lymphoma extra long with potent proapoptotic cell-based activity. J Med Chem54:1914-26 (2011) 
 
Apoptosis regulator Bcl-2
Name:Apoptosis regulator Bcl-2
Type:Homodimer or heterodimer
Mol. Mass.:26269.11
Organism:Homo sapiens (Human)
Description:P10415
Residue:239
BDBM50339783
NameBDBM50339783
Synonyms:CHEMBL1689145 | N-(7-{4-[2-(4-Chloro-phenyl)-5,5-dimethyl-cyclohex-1-enylmethyl]-piperazin-1-yl}quinazolin-4-yl)-4-((R)-3-dimethylamino-1-phenylsulfanylmethyl-propylamino)-3-trifluoromethanesulfonyl-benzenesulfonamide
TypeSmall organic molecule
Emp. Form.C46H53ClF3N7O4S3
Mol. Mass.956.601
SMILESCN(C)CC[C@H](CSc1ccccc1)Nc1ccc(cc1S(=O)(=O)C(F)(F)F)S(=O)(=O)Nc1ncnc2cc(ccc12)N1CCN(CC2=C(CCC(C)(C)C2)c2ccc(Cl)cc2)CC1