Reaction Details
TargetApoptosis regulator Bcl-2
LigandBDBM21447
Substrate/Competitorn/a
Meas. Tech.ChEMBL_735550 (CHEMBL1693055)
IC50 6.1±n/a nM
Citation Sleebs, BECzabotar, PEFairbrother, WJFairlie, WDFlygare, JAHuang, DCKersten, WJKoehler, MFLessene, GLowes, KParisot, JPSmith, BJSmith, MLSouers, AJStreet, IPYang, HBaell, JB Quinazoline sulfonamides as dual binders of the proteins B-cell lymphoma 2 and B-cell lymphoma extra long with potent proapoptotic cell-based activity. J Med Chem54:1914-26 (2011) 
 
Apoptosis regulator Bcl-2
Name:Apoptosis regulator Bcl-2
Type:Homodimer or heterodimer
Mol. Mass.:26269.11
Organism:Homo sapiens (Human)
Description:P10415
Residue:239
BDBM21447
NameBDBM21447
Synonyms:4-(4-{[2-(4-chlorophenyl)phenyl]methyl}piperazin-1-yl)-N-[(4-{[(2R)-4-(dimethylamino)-1-(phenylsulfanyl)butan-2-yl]amino}-3-nitrobenzene)sulfonyl]benzamide CHEMBL376408 US11760752, Compound ABT-737 | US9125913, ABT-737
TypeSmall organic molecule
Emp. Form.C42H45ClN6O5S2
Mol. Mass.813.427
SMILESCN(C)CC[C@H](CSc1ccccc1)Nc1ccc(cc1[N+]([O-])=O)S(=O)(=O)NC(=O)c1ccc(cc1)N1CCN(Cc2ccccc2-c2ccc(Cl)cc2)CC1