Reaction Details
TargetSerine/threonine-protein kinase PLK1
LigandBDBM50339794
Substrate/Competitorn/a
Meas. Tech.ChEMBL_735641 (CHEMBL1693343)
IC50 66±n/a nM
Citation Solanki, SInnocenti, PMas-Droux, CBoxall, KBarillari, Cvan Montfort, RLAherne, GWBayliss, RHoelder, S Benzimidazole inhibitors induce a DFG-out conformation of never in mitosis gene A-related kinase 2 (Nek2) without binding to the back pocket and reveal a nonlinear structure-activity relationship. J Med Chem54:1626-39 (2011) 
 
Serine/threonine-protein kinase PLK1
Name:Serine/threonine-protein kinase PLK1
Type:Serine/threonine-protein kinase
Mol. Mass.:68277.16
Organism:Homo sapiens (Human)
Description:P53350
Residue:603
BDBM50339794
NameBDBM50339794
Synonyms:(+/-)-5-(6-(1-Methylpiperidin-4-yloxy)-1H-benzo[d]imidazol-1-yl)-3-(1-phenylethoxy)thiophene-2-carboxamide | CHEMBL1689160
TypeSmall organic molecule
Emp. Form.C26H28N4O3S
Mol. Mass.476.591
SMILESCC(Oc1cc(sc1C(N)=O)-n1cnc2ccc(OC3CCN(C)CC3)cc12)c1ccccc1