Reaction Details
TargetSerine/threonine-protein kinase Nek2
LigandBDBM28216
Substrate/Competitorn/a
Meas. Tech.ChEMBL_735640 (CHEMBL1693342)
IC50 25±n/a nM
Citation Solanki, SInnocenti, PMas-Droux, CBoxall, KBarillari, Cvan Montfort, RLAherne, GWBayliss, RHoelder, S Benzimidazole inhibitors induce a DFG-out conformation of never in mitosis gene A-related kinase 2 (Nek2) without binding to the back pocket and reveal a nonlinear structure-activity relationship. J Med Chem54:1626-39 (2011) 
 
Serine/threonine-protein kinase Nek2
Name:Serine/threonine-protein kinase Nek2
Type:Enzyme
Mol. Mass.:51776.96
Organism:Homo sapiens (Human)
Description:P51955
Residue:445
BDBM28216
NameBDBM28216
Synonyms:5-{6-[(1-methylpiperidin-4-yl)oxy]-1H-1,3-benzodiazol-1-yl}-3-[(1R)-1-[2-(trifluoromethyl)phenyl]ethoxy]thiophene-2-carboxamide | benzimidazole thiophene carboxamide, 24
TypeSmall organic molecule
Emp. Form.C27H27F3N4O3S
Mol. Mass.544.588
SMILESC[C@@H](Oc1cc(sc1C(N)=O)-n1cnc2ccc(OC3CCN(C)CC3)cc12)c1ccccc1C(F)(F)F