Reaction Details
Target11-beta-hydroxysteroid dehydrogenase type 2
LigandBDBM50329192
Substrate/Competitorn/a
Meas. Tech.ChEMBL_735656 (CHEMBL1693471)
IC50 2.9±n/a nM
Citation Gaware, RKhunt, RCzollner, LStanetty, CDa Cunha, TKratschmar, DVOdermatt, AKosma, PJordis, UClassen-Houben, D Synthesis of new glycyrrhetinic acid derived ring A azepanone, 29-urea and 29-hydroxamic acid derivatives as selective 11ß-hydroxysteroid dehydrogenase 2 inhibitors. Bioorg Med Chem19:1866-80 (2011) 
 
11-beta-hydroxysteroid dehydrogenase type 2
Name:11-beta-hydroxysteroid dehydrogenase type 2
Type:Enzyme
Mol. Mass.:44141.72
Organism:Homo sapiens (Human)
Description:Purified recombinant human 11beta-HSD2.
Residue:405
BDBM50329192
NameBDBM50329192
Synonyms:(3beta,18beta,20beta)-3-Acetoxy-N-methyl-N-hydroxy-11-oxoolean-12-en-29-amide | CHEMBL1269273
TypeSmall organic molecule
Emp. Form.C33H51NO5
Mol. Mass.541.7617
SMILESCN(O)C(=O)[C@@]1(C)CC[C@]2(C)CC[C@]3(C)C(=CC(=O)[C@@H]4[C@@]5(C)CC[C@H](OC(C)=O)C(C)(C)[C@@H]5CC[C@@]34C)[C@@H]2C1