Reaction Details
Target11-beta-hydroxysteroid dehydrogenase type 2
LigandBDBM50339812
Substrate/Competitorn/a
Meas. Tech.ChEMBL_735656 (CHEMBL1693471)
IC50 17±n/a nM
Citation Gaware, RKhunt, RCzollner, LStanetty, CDa Cunha, TKratschmar, DVOdermatt, AKosma, PJordis, UClassen-Houben, D Synthesis of new glycyrrhetinic acid derived ring A azepanone, 29-urea and 29-hydroxamic acid derivatives as selective 11ß-hydroxysteroid dehydrogenase 2 inhibitors. Bioorg Med Chem19:1866-80 (2011) 
 
11-beta-hydroxysteroid dehydrogenase type 2
Name:11-beta-hydroxysteroid dehydrogenase type 2
Type:Enzyme
Mol. Mass.:44141.72
Organism:Homo sapiens (Human)
Description:Purified recombinant human 11beta-HSD2.
Residue:405
BDBM50339812
NameBDBM50339812
Synonyms:CHEMBL1689283 | N-[(3beta,18beta,20beta)-3-Hydroxy-11-oxo-30-norolean-12-en-20-yl]urea
TypeSmall organic molecule
Emp. Form.C30H48N2O3
Mol. Mass.484.7137
SMILESCC1(C)[C@@H](O)CC[C@@]2(C)[C@H]1CC[C@]1(C)[C@@H]2C(=O)C=C2[C@@H]3C[C@](C)(CC[C@]3(C)CC[C@@]12C)NC(N)=O