Reaction Details
TargetBeta-lactamase
LigandBDBM50339848
Substrate/Competitorn/a
Meas. Tech.ChEMBL_740684 (CHEMBL1763746)
Ki 19790±n/a nM
Citation Xia, YCao, KZhou, YAlley, MRRock, FMohan, MMeewan, MBaker, SJLux, SDing, CZJia, GKully, MPlattner, JJ Synthesis and SAR of novel benzoxaboroles as a new class of β-lactamase inhibitors. Bioorg Med Chem Lett21:2533-6 (2011) 
 
Beta-lactamase
Name:Beta-lactamase
Type:PROTEIN
Mol. Mass.:41306.67
Organism:Enterobacter cloacae
Description:ChEMBL_40258
Residue:381
BDBM50339848
NameBDBM50339848
Synonyms:6-benzylbenzo[c][1,2]oxaborol-1(3H)-ol | CHEMBL1761093
TypeSmall organic molecule
Emp. Form.C14H13BO2
Mol. Mass.224.063
SMILESOB1OCc2ccc(Cc3ccccc3)cc12