Reaction Details
TargetFatty-acid amide hydrolase 1
LigandBDBM50339882
Substrate/Competitorn/a
Meas. Tech.ChEMBL_740704 (CHEMBL1763766)
IC50 10±n/a nM
Citation Gustin, DJMa, ZMin, XLi, YHedberg, CGuimaraes, CPorter, ACLindstrom, MLester-Zeiner, DXu, GCarlson, TJXiao, SMeleza, CConnors, RWang, ZKayser, F Identification of potent, noncovalent fatty acid amide hydrolase (FAAH) inhibitors. Bioorg Med Chem Lett21:2492-6 (2011) 
 
Fatty-acid amide hydrolase 1
Name:Fatty-acid amide hydrolase 1
Type:Protein
Mol. Mass.:63071.19
Organism:Homo sapiens (Human)
Description:O00519
Residue:579
BDBM50339882
NameBDBM50339882
Synonyms:(S)-3-(1-(2-amino-6-(benzofuran-2-yl)pyrimidin-4-yl)piperidin-3-yl)-1-ethyl-1H-imidazo[4,5-b]pyridin-2(3H)-one | CHEMBL1761291
TypeSmall organic molecule
Emp. Form.C25H25N7O2
Mol. Mass.455.5117
SMILESCCn1c2cccnc2n([C@H]2CCCN(C2)c2cc(nc(N)n2)-c2cc3ccccc3o2)c1=O