Reaction Details
TargetFatty-acid amide hydrolase 1
LigandBDBM50339889
Substrate/Competitorn/a
Meas. Tech.ChEMBL_740704 (CHEMBL1763766)
IC50 30±n/a nM
Citation Gustin, DJMa, ZMin, XLi, YHedberg, CGuimaraes, CPorter, ACLindstrom, MLester-Zeiner, DXu, GCarlson, TJXiao, SMeleza, CConnors, RWang, ZKayser, F Identification of potent, noncovalent fatty acid amide hydrolase (FAAH) inhibitors. Bioorg Med Chem Lett21:2492-6 (2011) 
 
Fatty-acid amide hydrolase 1
Name:Fatty-acid amide hydrolase 1
Type:Protein
Mol. Mass.:63071.19
Organism:Homo sapiens (Human)
Description:O00519
Residue:579
BDBM50339889
NameBDBM50339889
Synonyms:(S)-1-(1-(2-(benzofuran-2-yl)pyrimidin-4-yl)piperidin-3-yl)-3-ethyl-1H-benzo[d]imidazol-2(3H)-one | CHEMBL1761289
TypeSmall organic molecule
Emp. Form.C26H25N5O2
Mol. Mass.439.509
SMILESCCn1c2ccccc2n([C@H]2CCCN(C2)c2ccnc(n2)-c2cc3ccccc3o2)c1=O