Reaction Details
TargetSqualene synthase
LigandBDBM50339919
Substrate/Competitorn/a
Meas. Tech.ChEMBL_740875 (CHEMBL1763976)
IC50 500±n/a nM
Citation Griebenow, NFlessner, TBuchmueller, ARaabe, MBischoff, HKolkhof, P Identification and optimization of tetrahydro-2H-3-benzazepin-2-ones as squalene synthase inhibitors. Bioorg Med Chem Lett21:2554-8 (2011) 
 
Squalene synthase
Name:Squalene synthase
Type:PROTEIN
Mol. Mass.:48114.76
Organism:Homo sapiens (Human)
Description:ChEMBL_1352847
Residue:417
BDBM50339919
NameBDBM50339919
Synonyms:CHEMBL1761661 | trans-rac-1-(2-(7-chloro-1-isobutyl-5-(2-methoxyphenyl)-2-oxo-4,5-dihydro-1H-benzo[d]azepin-3(2H)-yl)acetyl)piperidine-4-carboxylic acid
TypeSmall organic molecule
Emp. Form.C29H35ClN2O5
Mol. Mass.527.052
SMILESCOc1ccccc1[C@H]1CN(CC(=O)N2CCC(CC2)C(O)=O)C(=O)[C@H](CC(C)C)c2ccc(Cl)cc12