Reaction Details
TargetSqualene synthase
LigandBDBM50339920
Substrate/Competitorn/a
Meas. Tech.ChEMBL_740875 (CHEMBL1763976)
IC50 930±n/a nM
Citation Griebenow, NFlessner, TBuchmueller, ARaabe, MBischoff, HKolkhof, P Identification and optimization of tetrahydro-2H-3-benzazepin-2-ones as squalene synthase inhibitors. Bioorg Med Chem Lett21:2554-8 (2011) 
 
Squalene synthase
Name:Squalene synthase
Type:PROTEIN
Mol. Mass.:48114.76
Organism:Homo sapiens (Human)
Description:ChEMBL_1352847
Residue:417
BDBM50339920
NameBDBM50339920
Synonyms:CHEMBL1761659 | trans-rac-1-(2-(7-chloro-5-(2-chlorophenyl)-1-isobutyl-2-oxo-4,5-dihydro-1H-benzo[d]azepin-3(2H)-yl)acetyl)piperidine-4-carboxylic acid
TypeSmall organic molecule
Emp. Form.C28H32Cl2N2O4
Mol. Mass.531.471
SMILESCC(C)C[C@@H]1c2ccc(Cl)cc2[C@H](CN(CC(=O)N2CCC(CC2)C(O)=O)C1=O)c1ccccc1Cl