Reaction Details
TargetPolyphenol oxidase 2
LigandBDBM50339940
Substrate/Competitorn/a
Meas. Tech.ChEMBL_739660 (CHEMBL1763486)
IC50 10±n/a nM
Citation Ha, YMPark, JYPark, YJPark, DChoi, YJKim, JMLee, EKHan, YKKim, JALee, JYMoon, HRChung, HY Synthesis and biological activity of hydroxy substituted phenyl-benzo[d]thiazole analogues for antityrosinase activity in B16 cells. Bioorg Med Chem Lett21:2445-9 (2011) 
 
Polyphenol oxidase 2
Name:Polyphenol oxidase 2
Type:Protein
Mol. Mass.:63923.66
Organism:Agaricus bisporus (Common mushroom)
Description:O42713
Residue:556
BDBM50339940
NameBDBM50339940
Synonyms:4-(Benzo[d]thiazol-2-yl)benzene-1,3-diol | CHEMBL1408767
TypeSmall organic molecule
Emp. Form.C13H9NO2S
Mol. Mass.243.281
SMILESOc1ccc(-c2nc3ccccc3s2)c(O)c1