Reaction Details
TargetAcetylcholinesterase
LigandBDBM50262988
Substrate/Competitorn/a
Meas. Tech.ChEMBL_739676 (CHEMBL1763502)
Ki 5±n/a nM
Citation Komloova, MMusilek, KHorova, AHolas, ODohnal, VGunn-Moore, FKuca, K Preparation, in vitro screening and molecular modelling of symmetrical bis-quinolinium cholinesterase inhibitors--implications for early myasthenia gravis treatment. Bioorg Med Chem Lett21:2505-9 (2011) 
 
Acetylcholinesterase
Name:Acetylcholinesterase
Type:Enzyme
Mol. Mass.:67792.70
Organism:Homo sapiens (Human)
Description:P22303
Residue:614
BDBM50262988
NameBDBM50262988
Synonyms:CHEMBL1200541 ambenonium
TypeSmall organic molecule
Emp. Form.C28H42Cl2N4O2
Mol. Mass.537.564
SMILESCC[N+](CC)(CCNC(=O)C(=O)NCC[N+](CC)(CC)Cc1ccccc1Cl)Cc1ccccc1Cl