Reaction Details
TargetAcetylcholinesterase
LigandBDBM50119797
Substrate/Competitorn/a
Meas. Tech.ChEMBL_739677 (CHEMBL1763503)
Ki 60±n/a nM
Citation Komloova, MMusilek, KHorova, AHolas, ODohnal, VGunn-Moore, FKuca, K Preparation, in vitro screening and molecular modelling of symmetrical bis-quinolinium cholinesterase inhibitors--implications for early myasthenia gravis treatment. Bioorg Med Chem Lett21:2505-9 (2011) 
 
Acetylcholinesterase
Name:Acetylcholinesterase
Type:Enzyme
Mol. Mass.:67792.70
Organism:Homo sapiens (Human)
Description:P22303
Residue:614
BDBM50119797
NameBDBM50119797
Synonyms:1,1'-(decane-1,10-diyl)diquinolinium iodide CHEMBL225577 | CHEMBL419357
TypeSmall organic molecule
Emp. Form.C28H34N2
Mol. Mass.398.5819
SMILESC(CCCCC[n+]1cccc2ccccc12)CCCC[n+]1cccc2ccccc12