Reaction Details
TargetNitric oxide synthase, inducible
LigandBDBM50124535
Substrate/Competitorn/a
Meas. Tech.ChEMBL_740009 (CHEMBL1763069)
IC50 41±n/a nM
Citation Cheshire, DRÅberg, AAndersson, GMAndrews, GBeaton, HGBirkinshaw, TNBoughton-Smith, NConnolly, SCook, TRCooper, ACooper, SLCox, DDixon, JGensmantel, NHamley, PJHarrison, RHartopp, PKäck, HLeeson, PDLuker, TMete, AMillichip, INicholls, DJPimm, ADSt-Gallay, SAWallace, AV The discovery of novel, potent and highly selective inhibitors of inducible nitric oxide synthase (iNOS). Bioorg Med Chem Lett21:2468-71 (2011) 
 
Nitric oxide synthase, inducible
Name:Nitric oxide synthase, inducible
Type:Homodimer
Mol. Mass.:131141.95
Organism:Homo sapiens (Human)
Description:P35228
Residue:1153
BDBM50124535
NameBDBM50124535
Synonyms:1-(6-CYANO-3-PYRIDYLCARBONYL)-5',8'-DIFLUOROSPIRO[PIPERIDINE-4,2'(1'H)-QUINAZOLINE]-4'-AMINE 5-(4-Amino-5,8-difluorospiro[1H-quinazoline-2,4'-piperidine]-1'-carbonyl)pyridine-2-carbonitrile, 3 5-[4'-amino-5',8'-difluorospiro[hexahydropyridine-4,2'-(1',2'-dihydroquinazoline)]-1-ylcarbonyl]-2-pyridinecarbonitrile CHEMBL447183
TypeSmall organic molecule
Emp. Form.C19H16F2N6O
Mol. Mass.382.3667
SMILESNC1=NC2(CCN(CC2)C(=O)c2ccc(nc2)C#N)Nc2c(F)ccc(F)c12