Reaction Details
TargetNitric oxide synthase, inducible
LigandBDBM50339995
Substrate/Competitorn/a
Meas. Tech.ChEMBL_740009 (CHEMBL1763069)
IC50 22±n/a nM
Citation Cheshire, DRÅberg, AAndersson, GMAndrews, GBeaton, HGBirkinshaw, TNBoughton-Smith, NConnolly, SCook, TRCooper, ACooper, SLCox, DDixon, JGensmantel, NHamley, PJHarrison, RHartopp, PKäck, HLeeson, PDLuker, TMete, AMillichip, INicholls, DJPimm, ADSt-Gallay, SAWallace, AV The discovery of novel, potent and highly selective inhibitors of inducible nitric oxide synthase (iNOS). Bioorg Med Chem Lett21:2468-71 (2011) 
 
Nitric oxide synthase, inducible
Name:Nitric oxide synthase, inducible
Type:Homodimer
Mol. Mass.:131141.95
Organism:Homo sapiens (Human)
Description:P35228
Residue:1153
BDBM50339995
NameBDBM50339995
Synonyms:(R)-3-(2,5-dichlorophenoxy)-N-methyl-3-phenylpropan-1-amine fumarate | CHEMBL1762471
TypeSmall organic molecule
Emp. Form.C16H17Cl2NO
Mol. Mass.310.218
SMILESCNCC[C@@H](Oc1cc(Cl)ccc1Cl)c1ccccc1