Reaction Details
TargetAdenosine receptor A2a
LigandBDBM50340047
Substrate/Competitorn/a
Meas. Tech.ChEMBL_739869 (CHEMBL1762929)
Ki 14.2±n/a nM
Citation Harris, JMNeustadt, BRZhang, HLachowicz, JCohen-Williams, MVarty, GHao, JStamford, AW Potent and selective adenosine A(2A) receptor antagonists: [1,2,4]-triazolo[4,3-c]pyrimidin-3-ones. Bioorg Med Chem Lett21:2497-501 (2011) 
 
Adenosine receptor A2a
Name:Adenosine receptor A2a
Type:G Protein-Coupled Receptor (GPCR)
Mol. Mass.:44716.46
Organism:Homo sapiens (Human)
Description:P29274
Residue:412
BDBM50340047
NameBDBM50340047
Synonyms:5-amino-2-(3-chlorobenzyl)-7-(2-morpholinoethyl)-2H-pyrazolo[4,3-e][1,2,4]triazolo[4,3-c]pyrimidin-3(7H)-one | CHEMBL1762515
TypeSmall organic molecule
Emp. Form.C19H21ClN8O2
Mol. Mass.428.875
SMILESNc1nc2n(CCN3CCOCC3)ncc2c2nn(Cc3cccc(Cl)c3)c(=O)n12