Reaction Details
TargetPotassium voltage-gated channel subfamily H member 2
LigandBDBM50418111
Substrate/Competitorn/a
Meas. Tech.ChEMBL_739892 (CHEMBL1762952)
Ki 1995.26±n/a nM
Citation Ratcliffe, PAdam, JMBaker, JBursi, RCampbell, RClark, JKCottney, JEDeehan, MEasson, AMEcker, DEdwards, DEpemolu, OEvans, LFields, RFrancis, SHarradine, PJeremiah, FKiyoi, TMcArthur, DMorrison, APassier, PPick, JSchnabel, PGSchulz, JSteinbrede, HWalker, GWestwood, PWishart, Gde Haes, JU Design, synthesis and structure-activity relationships of (indo-3-yl) heterocyclic derivatives as agonists of the CB1 receptor. Discovery of a clinical candidate. Bioorg Med Chem Lett21:2541-6 (2011) 
 
Potassium voltage-gated channel subfamily H member 2
Name:Potassium voltage-gated channel subfamily H member 2
Type:Multi-pass membrane protein
Mol. Mass.:126672.65
Organism:Homo sapiens (Human)
Description:Q12809
Residue:1159
BDBM50418111
NameBDBM50418111
Synonyms:CHEMBL1762806
TypeSmall organic molecule
Emp. Form.C21H26ClN3O2S
Mol. Mass.419.968
SMILESCN(CCO)Cc1csc(n1)-c1cn(CC2CCOCC2)c2c(Cl)cccc12