Reaction Details
TargetInsulin-like growth factor 1 receptor
LigandBDBM50340126
Substrate/Competitorn/a
Meas. Tech.ChEMBL_741201 (CHEMBL1764523)
IC50 8.4±n/a nM
Citation Buchanan, JLNewcomb, JRCarney, DPChaffee, SCChai, LCupples, REpstein, LFGallant, PGu, YHarmange, JCHodge, KHouk, BEHuang, XJona, JJoseph, SJun, HTKumar, RLi, CLu, JMenges, TMorrison, MJNovak, PMvan der Plas, SRadinsky, RRose, PESawant, SSun, JRSurapaneni, STurci, SMXu, KYanez, EZhao, HZhu, X Discovery of 2,4-bis-arylamino-1,3-pyrimidines as insulin-like growth factor-1 receptor (IGF-1R) inhibitors. Bioorg Med Chem Lett21:2394-9 (2011) 
 
Insulin-like growth factor 1 receptor
Name:Insulin-like growth factor 1 receptor
Type:Protein
Mol. Mass.:154776.79
Organism:Homo sapiens (Human)
Description:P08069
Residue:1367
BDBM50340126
NameBDBM50340126
Synonyms:CHEMBL1738698 N~2~-[3-methoxy-4-(morpholin-4-yl)phenyl]-N~4~-(quinolin-3-yl)pyrimidine-2,4-diamine
TypeSmall organic molecule
Emp. Form.C24H24N6O2
Mol. Mass.428.4864
SMILESCOc1cc(Nc2nccc(Nc3cnc4ccccc4c3)n2)ccc1N1CCOCC1