Reaction Details
TargetCorticotropin-releasing factor receptor 1
LigandBDBM50058163
Substrate/Competitorn/a
Meas. Tech.ChEMBL_741365 (CHEMBL1764891)
IC50 11±n/a nM
Citation Aso, KKobayashi, KMochizuki, MKanzaki, NSako, YYano, T Discovery of pyrrolo[2,3-d]pyrimidin-4-ones as corticotropin-releasing factor 1 receptor antagonists with a carbonyl-based hydrogen bonding acceptor. Bioorg Med Chem Lett21:2365-71 (2011) 
 
Corticotropin-releasing factor receptor 1
Name:Corticotropin-releasing factor receptor 1
Type:Enzyme
Mol. Mass.:50744.31
Organism:Homo sapiens (Human)
Description:P34998
Residue:444
BDBM50058163
NameBDBM50058163
Synonyms:Butyl-[2,5-dimethyl-7-(2,4,6-trimethyl-phenyl)-7H-pyrrolo[2,3-d]pyrimidin-4-yl]-ethyl-amine CP 154,526 N-butyl-N-ethyl-7-mesityl-2,5-dimethyl-7H-pyrrolo[2,3-d]pyrimidin-4-amine
TypeSmall organic molecule
Emp. Form.C23H32N4
Mol. Mass.364.527
SMILESCCCCN(CC)c1nc(C)nc2n(cc(C)c12)-c1c(C)cc(C)cc1C