Reaction Details
TargetHeat shock protein HSP 90-alpha
LigandBDBM50340246
Substrate/Competitorn/a
Meas. Tech.ChEMBL_741463 (CHEMBL1763722)
IC50 12440±n/a nM
Citation Zapf, CWBloom, JDMcBean, JLDushin, RGNittoli, TIngalls, CSutherland, AGSonye, JPEid, CNGolas, JLiu, HBoschelli, FHu, YVogan, ELevin, JI Design and SAR of macrocyclic Hsp90 inhibitors with increased metabolic stability and potent cell-proliferation activity. Bioorg Med Chem Lett21:2278-82 (2011) 
 
Heat shock protein HSP 90-alpha
Name:Heat shock protein HSP 90-alpha
Type:Molecular Chaperone
Mol. Mass.:84623.45
Organism:Homo sapiens (Human)
Description:P07900
Residue:732
BDBM50340246
NameBDBM50340246
Synonyms:CHEMBL1760599
TypeSmall organic molecule
Emp. Form.C22H28N4O2
Mol. Mass.380.4833
SMILESCc1c2CCNCCNc3cc(ccc3C(N)=O)-n2c2CC(C)(C)CC(=O)c12