Reaction Details
TargetRAF proto-oncogene serine/threonine-protein kinase
LigandBDBM50340267
Substrate/Competitorn/a
Meas. Tech.ChEMBL_741467 (CHEMBL1763782)
IC50 340±n/a nM
Citation Buchstaller, HPBurgdorf, LFinsinger, DStieber, FSirrenberg, CAmendt, CGrell, MZenke, FKrier, M Design and synthesis of isoquinolines and benzimidazoles as RAF kinase inhibitors. Bioorg Med Chem Lett21:2264-9 (2011) 
 
RAF proto-oncogene serine/threonine-protein kinase
Name:RAF proto-oncogene serine/threonine-protein kinase
Type:Serine/threonine-protein kinase
Mol. Mass.:73082.52
Organism:Homo sapiens (Human)
Description:P04049
Residue:648
BDBM50340267
NameBDBM50340267
Synonyms:7-(2-(3-(4-chloro-2-(2-(dimethylamino)ethoxy)-5-(trifluoromethyl)phenyl)ureido)ethyl)-N-methylisoquinoline-3-carboxamide | CHEMBL1760627
TypeSmall organic molecule
Emp. Form.C25H27ClF3N5O3
Mol. Mass.537.962
SMILESCNC(=O)c1cc2ccc(CCNC(=O)Nc3cc(c(Cl)cc3OCCN(C)C)C(F)(F)F)cc2cn1