Reaction Details
TargetRAF proto-oncogene serine/threonine-protein kinase
LigandBDBM50340273
Substrate/Competitorn/a
Meas. Tech.ChEMBL_741467 (CHEMBL1763782)
IC50 140±n/a nM
Citation Buchstaller, HPBurgdorf, LFinsinger, DStieber, FSirrenberg, CAmendt, CGrell, MZenke, FKrier, M Design and synthesis of isoquinolines and benzimidazoles as RAF kinase inhibitors. Bioorg Med Chem Lett21:2264-9 (2011) 
 
RAF proto-oncogene serine/threonine-protein kinase
Name:RAF proto-oncogene serine/threonine-protein kinase
Type:Serine/threonine-protein kinase
Mol. Mass.:73082.52
Organism:Homo sapiens (Human)
Description:P04049
Residue:648
BDBM50340273
NameBDBM50340273
Synonyms:CHEMBL1760633 | N-(6-(2-(3-(4-chloro-3-(trifluoromethyl)phenyl)ureido)ethyl)-1H-benzo[d]imidazol-2-yl)acetamide
TypeSmall organic molecule
Emp. Form.C19H17ClF3N5O2
Mol. Mass.439.819
SMILESCC(=O)Nc1nc2ccc(CCNC(=O)Nc3ccc(Cl)c(c3)C(F)(F)F)cc2[nH]1