Reaction Details
TargetRAF proto-oncogene serine/threonine-protein kinase
LigandBDBM50340282
Substrate/Competitorn/a
Meas. Tech.ChEMBL_741467 (CHEMBL1763782)
IC50 230±n/a nM
Citation Buchstaller, HPBurgdorf, LFinsinger, DStieber, FSirrenberg, CAmendt, CGrell, MZenke, FKrier, M Design and synthesis of isoquinolines and benzimidazoles as RAF kinase inhibitors. Bioorg Med Chem Lett21:2264-9 (2011) 
 
RAF proto-oncogene serine/threonine-protein kinase
Name:RAF proto-oncogene serine/threonine-protein kinase
Type:Serine/threonine-protein kinase
Mol. Mass.:73082.52
Organism:Homo sapiens (Human)
Description:P04049
Residue:648
BDBM50340282
NameBDBM50340282
Synonyms:CHEMBL1760642 | N-(6-(2-(3-(4-chloro-2-(2-(methylamino)ethoxy)-5-(trifluoromethyl)phenyl)ureido)ethyl)-1H-benzo[d]imidazol-2-yl)acetamide
TypeSmall organic molecule
Emp. Form.C22H24ClF3N6O3
Mol. Mass.512.913
SMILESCNCCOc1cc(Cl)c(cc1NC(=O)NCCc1ccc2nc(NC(C)=O)[nH]c2c1)C(F)(F)F