Reaction Details
TargetRAF proto-oncogene serine/threonine-protein kinase
LigandBDBM50340287
Substrate/Competitorn/a
Meas. Tech.ChEMBL_741467 (CHEMBL1763782)
IC50 260±n/a nM
Citation Buchstaller, HPBurgdorf, LFinsinger, DStieber, FSirrenberg, CAmendt, CGrell, MZenke, FKrier, M Design and synthesis of isoquinolines and benzimidazoles as RAF kinase inhibitors. Bioorg Med Chem Lett21:2264-9 (2011) 
 
RAF proto-oncogene serine/threonine-protein kinase
Name:RAF proto-oncogene serine/threonine-protein kinase
Type:Serine/threonine-protein kinase
Mol. Mass.:73082.52
Organism:Homo sapiens (Human)
Description:P04049
Residue:648
BDBM50340287
NameBDBM50340287
Synonyms:CHEMBL1760616 | N-methyl-7-(2-(3-(3-(trifluoromethoxy)phenyl)ureido)ethyl)isoquinoline-3-carboxamide
TypeSmall organic molecule
Emp. Form.C21H19F3N4O3
Mol. Mass.432.3958
SMILESCNC(=O)c1cc2ccc(CCNC(=O)Nc3cccc(OC(F)(F)F)c3)cc2cn1