Reaction Details
TargetRAF proto-oncogene serine/threonine-protein kinase
LigandBDBM50340289
Substrate/Competitorn/a
Meas. Tech.ChEMBL_741467 (CHEMBL1763782)
IC50 370±n/a nM
Citation Buchstaller, HPBurgdorf, LFinsinger, DStieber, FSirrenberg, CAmendt, CGrell, MZenke, FKrier, M Design and synthesis of isoquinolines and benzimidazoles as RAF kinase inhibitors. Bioorg Med Chem Lett21:2264-9 (2011) 
 
RAF proto-oncogene serine/threonine-protein kinase
Name:RAF proto-oncogene serine/threonine-protein kinase
Type:Serine/threonine-protein kinase
Mol. Mass.:73082.52
Organism:Homo sapiens (Human)
Description:P04049
Residue:648
BDBM50340289
NameBDBM50340289
Synonyms:CHEMBL1760618 | N-methyl-7-(2-(3-(4-(trifluoromethyl)phenyl)ureido)ethyl)isoquinoline-3-carboxamide
TypeSmall organic molecule
Emp. Form.C21H19F3N4O2
Mol. Mass.416.3964
SMILESCNC(=O)c1cc2ccc(CCNC(=O)Nc3ccc(cc3)C(F)(F)F)cc2cn1